{"text_format":"1","workbook":"xlsx","n_sheets":10,"sheets":["FotoDoku","Vorteile VOLLVERSION","Vorlage-1","Vorlage-2","Vorlage-3","Vorlage-4","Titelblatt","Anleitung","Lizenz","Stammdaten"],"not_rendered":{"charts":0,"images":11,"macros":1,"external_links":0,"defined_names":10,"comments":1,"pivot_tables":0},"unopened":[],"bounds":{"document_bytes":16777216,"sheet_cells":100000,"rows_first":2000,"rows_last":500,"rows_between":2000,"halvings":0,"cell_chars":16384,"cell_head_chars":4096},"cells_cut":0,"cells_raw":0,"read":"whole","date_system":"1900"}

{"sheet":"FotoDoku","index":0,"n_rows":35,"n_cols":14,"rows_kept":35,"cut":false,"hidden":false,"merged":[[0,6,0,8],[3,5,3,9],[1,16380,14,16380],[1,16381,14,16381],[1,16382,14,16382],[1,16383,14,16383],[1,16375,14,16375],[1,16376,14,16376],[1,16377,14,16377],[1,16378,14,16378],[1,16379,14,16379],[1,16370,14,16370],[1,16371,14,16371],[1,16372,14,16372],[1,16373,14,16373],[1,16374,14,16374],[1,16365,14,16365],[1,16366,14,16366],[1,16367,14,16367],[1,16368,14,16368],[1,16369,14,16369],[1,16360,14,16360],[1,16361,14,16361],[1,16362,14,16362],[1,16363,14,16363],[1,16364,14,16364],[1,16355,14,16355],[1,16356,14,16356],[1,16357,14,16357],[1,16358,14,16358],[1,16359,14,16359],[1,16350,14,16350],[1,16351,14,16351],[1,16352,14,16352],[1,16353,14,16353],[1,16354,14,16354],[1,16345,14,16345],[1,16346,14,16346],[1,16347,14,16347],[1,16348,14,16348],[1,16349,14,16349],[1,16340,14,16340],[1,16341,14,16341],[1,16342,14,16342],[1,16343,14,16343],[1,16344,14,16344],[1,16335,14,16335],[1,16336,14,16336],[1,16337,14,16337],[1,16338,14,16338],[1,16339,14,16339],[1,16330,14,16330],[1,16331,14,16331],[1,16332,14,16332],[1,16333,14,16333],[1,16334,14,16334],[1,16325,14,16325],[1,16269,14,16269],[1,16260,14,16260],[1,16261,14,16261],[1,16262,14,16262],[1,13,11,13],[12,13,14,13],[1,16326,14,16326],[1,16327,14,16327],[1,16328,14,16328],[1,16329,14,16329],[1,16320,14,16320],[1,16321,14,16321],[1,16322,14,16322],[1,16323,14,16323],[1,16324,14,16324],[1,16315,14,16315],[1,16316,14,16316],[1,16317,14,16317],[1,16318,14,16318],[1,16319,14,16319],[1,16310,14,16310],[1,16311,14,16311],[1,16312,14,16312],[1,16313,14,16313],[1,16314,14,16314],[1,16305,14,16305],[1,16306,14,16306],[1,16307,14,16307],[1,16308,14,16308],[1,16309,14,16309],[1,16300,14,16300],[1,16301,14,16301],[1,16302,14,16302],[1,16303,14,16303],[1,16304,14,16304],[1,16295,14,16295],[1,16296,14,16296],[1,16297,14,16297],[1,16298,14,16298],[1,16299,14,16299],[1,16290,14,16290],[1,16291,14,16291],[1,16292,14,16292],[1,16293,14,16293],[1,16294,14,16294],[1,16285,14,16285],[1,16286,14,16286],[1,16287,14,16287],[1,16288,14,16288],[1,16289,14,16289],[1,16280,14,16280],[1,16281,14,16281],[1,16282,14,16282],[1,16283,14,16283],[1,16284,14,16284],[1,16275,14,16275],[1,16276,14,16276],[1,16277,14,16277],[1,16278,14,16278],[1,16279,14,16279],[1,16270,14,16270],[1,16271,14,16271],[1,16272,14,16272],[1,16273,14,16273],[1,16274,14,16274],[1,16265,14,16265],[1,16266,14,16266],[1,16267,14,16267],[1,16268,14,16268],[1,16263,14,16263],[1,16264,14,16264],[1,16255,14,16255],[1,16256,14,16256],[1,16257,14,16257],[1,16258,14,16258],[1,16259,14,16259],[1,16250,14,16250],[1,16251,14,16251],[1,16252,14,16252],[1,16253,14,16253],[1,16254,14,16254],[1,16245,14,16245],[1,16246,14,16246],[1,16247,14,16247],[1,16248,14,16248],[1,16249,14,16249],[1,16240,14,16240],[1,16241,14,16241],[1,16242,14,16242],[1,16243,14,16243],[1,16244,14,16244],[1,16235,14,16235],[1,16236,14,16236],[1,16237,14,16237],[1,16238,14,16238],[1,16239,14,16239],[1,16230,14,16230],[1,16231,14,16231],[1,16232,14,16232],[1,16233,14,16233],[1,16234,14,16234],[1,16225,14,16225],[1,16226,14,16226],[1,16227,14,16227],[1,16228,14,16228],[1,16229,14,16229],[1,16220,14,16220],[1,16221,14,16221],[1,16222,14,16222],[1,16223,14,16223],[1,16224,14,16224],[1,16215,14,16215],[1,16216,14,16216],[1,16217,14,16217],[1,16218,14,16218],[1,16219,14,16219],[1,16210,14,16210],[1,16211,14,16211],[1,16212,14,16212],[1,16213,14,16213],[1,16214,14,16214],[1,16205,14,16205],[1,16206,14,16206],[1,16207,14,16207],[1,16208,14,16208],[1,16209,14,16209],[1,16200,14,16200],[1,16201,14,16201],[1,16202,14,16202],[1,16203,14,16203],[1,16204,14,16204],[1,16195,14,16195],[1,16196,14,16196],[1,16197,14,16197],[1,16198,14,16198],[1,16199,14,16199],[1,16190,14,16190],[1,16191,14,16191],[1,16192,14,16192],[1,16193,14,16193],[1,16194,14,16194],[1,16185,14,16185],[1,16186,14,16186],[1,16187,14,16187],[1,16188,14,16188],[1,16189,14,16189],[1,16180,14,16180],[1,16181,14,16181],[1,16182,14,16182],[1,16183,14,16183],[1,16184,14,16184],[1,16175,14,16175],[1,16176,14,16176],[1,16177,14,16177],[1,16178,14,16178],[1,16179,14,16179],[1,16170,14,16170],[1,16171,14,16171],[1,16172,14,16172],[1,16173,14,16173],[1,16174,14,16174],[1,16165,14,16165],[1,16166,14,16166],[1,16167,14,16167],[1,16168,14,16168],[1,16169,14,16169],[1,16160,14,16160],[1,16161,14,16161],[1,16162,14,16162],[1,16163,14,16163],[1,16164,14,16164],[1,16155,14,16155],[1,16156,14,16156],[1,16157,14,16157],[1,16158,14,16158],[1,16159,14,16159],[1,16150,14,16150],[1,16151,14,16151],[1,16152,14,16152],[1,16153,14,16153],[1,16154,14,16154],[1,16145,14,16145],[1,16146,14,16146],[1,16147,14,16147],[1,16148,14,16148],[1,16149,14,16149],[1,16140,14,16140],[1,16141,14,16141],[1,16142,14,16142],[1,16143,14,16143],[1,16144,14,16144],[1,16135,14,16135],[1,16136,14,16136],[1,16137,14,16137],[1,16138,14,16138],[1,16139,14,16139],[1,16130,14,16130],[1,16131,14,16131],[1,16132,14,16132],[1,16133,14,16133],[1,16134,14,16134],[1,16125,14,16125],[1,16126,14,16126],[1,16127,14,16127],[1,16128,14,16128],[1,16129,14,16129],[1,16120,14,16120],[1,16121,14,16121],[1,16122,14,16122],[1,16123,14,16123],[1,16124,14,16124],[1,16115,14,16115],[1,16116,14,16116],[1,16117,14,16117],[1,16118,14,16118],[1,16119,14,16119],[1,16110,14,16110],[1,16111,14,16111],[1,16112,14,16112],[1,16113,14,16113],[1,16114,14,16114],[1,16105,14,16105],[1,16106,14,16106],[1,16107,14,16107],[1,16108,14,16108],[1,16109,14,16109],[1,16100,14,16100],[1,16101,14,16101],[1,16102,14,16102],[1,16103,14,16103],[1,16104,14,16104],[1,16095,14,16095],[1,16096,14,16096],[1,16097,14,16097],[1,16098,14,16098],[1,16099,14,16099],[1,16090,14,16090],[1,16091,14,16091],[1,16092,14,16092],[1,16093,14,16093],[1,16094,14,16094],[1,16085,14,16085],[1,16086,14,16086],[1,16087,14,16087],[1,16088,14,16088],[1,16089,14,16089],[1,16080,14,16080],[1,16081,14,16081],[1,16082,14,16082],[1,16083,14,16083],[1,16084,14,16084],[1,16075,14,16075],[1,16076,14,16076],[1,16077,14,16077],[1,16078,14,16078],[1,16079,14,16079],[1,16070,14,16070],[1,16071,14,16071],[1,16072,14,16072],[1,16073,14,16073],[1,16074,14,16074],[1,16065,14,16065],[1,16066,14,16066],[1,16067,14,16067],[1,16068,14,16068],[1,16069,14,16069],[1,16060,14,16060],[1,16061,14,16061],[1,16062,14,16062],[1,16063,14,16063],[1,16064,14,16064],[1,16055,14,16055],[1,16056,14,16056],[1,16057,14,16057],[1,16058,14,16058],[1,16059,14,16059],[1,16050,14,16050],[1,16051,14,16051],[1,16052,14,16052],[1,16053,14,16053],[1,16054,14,16054],[1,16045,14,16045],[1,16046,14,16046],[1,16047,14,16047],[1,16048,14,16048],[1,16049,14,16049],[1,16040,14,16040],[1,16041,14,16041],[1,16042,14,16042],[1,16043,14,16043],[1,16044,14,16044],[1,16035,14,16035],[1,16036,14,16036],[1,16037,14,16037],[1,16038,14,16038],[1,16039,14,16039],[1,16030,14,16030],[1,16031,14,16031],[1,16032,14,16032],[1,16033,14,16033],[1,16034,14,16034],[1,16025,14,16025],[1,16026,14,16026],[1,16027,14,16027],[1,16028,14,16028],[1,16029,14,16029],[1,16020,14,16020],[1,16021,14,16021],[1,16022,14,16022],[1,16023,14,16023],[1,16024,14,16024],[1,16015,14,16015],[1,16016,14,16016],[1,16017,14,16017],[1,16018,14,16018],[1,16019,14,16019],[1,16010,14,16010],[1,16011,14,16011],[1,16012,14,16012],[1,16013,14,16013],[1,16014,14,16014],[1,16005,14,16005],[1,16006,14,16006],[1,16007,14,16007],[1,16008,14,16008],[1,16009,14,16009],[1,16000,14,16000],[1,16001,14,16001],[1,16002,14,16002],[1,16003,14,16003],[1,16004,14,16004],[1,15995,14,15995],[1,15996,14,15996],[1,15997,14,15997],[1,15998,14,15998],[1,15999,14,15999],[1,15990,14,15990],[1,15991,14,15991],[1,15992,14,15992],[1,15993,14,15993],[1,15994,14,15994],[1,15985,14,15985],[1,15986,14,15986],[1,15987,14,15987],[1,15988,14,15988],[1,15989,14,15989],[1,15980,14,15980],[1,15981,14,15981],[1,15982,14,15982],[1,15983,14,15983],[1,15984,14,15984],[1,15975,14,15975],[1,15976,14,15976],[1,15977,14,15977],[1,15978,14,15978],[1,15979,14,15979],[1,15970,14,15970],[1,15971,14,15971],[1,15972,14,15972],[1,15973,14,15973],[1,15974,14,15974],[1,15965,14,15965],[1,15966,14,15966],[1,15967,14,15967],[1,15968,14,15968],[1,15969,14,15969],[1,15960,14,15960],[1,15961,14,15961],[1,15962,14,15962],[1,15963,14,15963],[1,15964,14,15964],[1,15955,14,15955],[1,15956,14,15956],[1,15957,14,15957],[1,15958,14,15958],[1,15959,14,15959],[1,15950,14,15950],[1,15951,14,15951],[1,15952,14,15952],[1,15953,14,15953],[1,15954,14,15954],[1,15945,14,15945],[1,15946,14,15946],[1,15947,14,15947],[1,15948,14,15948],[1,15949,14,15949],[1,15940,14,15940],[1,15941,14,15941],[1,15942,14,15942],[1,15943,14,15943],[1,15944,14,15944],[1,15935,14,15935],[1,15936,14,15936],[1,15937,14,15937],[1,15938,14,15938],[1,15939,14,15939],[1,15930,14,15930],[1,15931,14,15931],[1,15932,14,15932],[1,15933,14,15933],[1,15934,14,15934],[1,15925,14,15925],[1,15926,14,15926],[1,15927,14,15927],[1,15928,14,15928],[1,15929,14,15929],[1,15920,14,15920],[1,15921,14,15921],[1,15922,14,15922],[1,15923,14,15923],[1,15924,14,15924],[1,15915,14,15915],[1,15916,14,15916],[1,15917,14,15917],[1,15918,14,15918],[1,15919,14,15919],[1,15910,14,15910],[1,15911,14,15911],[1,15912,14,15912],[1,15913,14,15913],[1,15914,14,15914],[1,15905,14,15905],[1,15906,14,15906],[1,15907,14,15907],[1,15908,14,15908],[1,15909,14,15909],[1,15900,14,15900],[1,15901,14,15901],[1,15902,14,15902],[1,15903,14,15903],[1,15904,14,15904],[1,15895,14,15895],[1,15896,14,15896],[1,15897,14,15897],[1,15898,14,15898],[1,15899,14,15899],[1,15890,14,15890],[1,15891,14,15891],[1,15892,14,15892],[1,15893,14,15893],[1,15894,14,15894],[1,15885,14,15885],[1,15886,14,15886],[1,15887,14,15887],[1,15888,14,15888],[1,15889,14,15889],[1,15880,14,15880],[1,15881,14,15881],[1,15882,14,15882],[1,15883,14,15883],[1,15884,14,15884],[1,15875,14,15875],[1,15876,14,15876],[1,15877,14,15877],[1,15878,14,15878],[1,15879,14,15879],[1,15870,14,15870],[1,15871,14,15871],[1,15872,14,15872],[1,15873,14,15873],[1,15874,14,15874],[1,15865,14,15865],[1,15866,14,15866],[1,15867,14,15867],[1,15868,14,15868],[1,15869,14,15869],[1,15860,14,15860],[1,15861,14,15861],[1,15862,14,15862],[1,15863,14,15863],[1,15864,14,15864],[1,15855,14,15855],[1,15856,14,15856],[1,15857,14,15857],[1,15858,14,15858],[1,15859,14,15859],[1,15850,14,15850],[1,15851,14,15851],[1,15852,14,15852],[1,15853,14,15853],[1,15854,14,15854],[1,15845,14,15845],[1,15846,14,15846],[1,15847,14,15847],[1,15848,14,15848],[1,15849,14,15849],[1,15840,14,15840],[1,15841,14,15841],[1,15842,14,15842],[1,15843,14,15843],[1,15844,14,15844],[1,15835,14,15835],[1,15836,14,15836],[1,15837,14,15837],[1,15838,14,15838],[1,15839,14,15839],[1,15830,14,15830],[1,15831,14,15831],[1,15832,14,15832],[1,15833,14,15833],[1,15834,14,15834],[1,15825,14,15825],[1,15826,14,15826],[1,15827,14,15827],[1,15828,14,15828],[1,15829,14,15829],[1,15820,14,15820],[1,15821,14,15821],[1,15822,14,15822],[1,15823,14,15823],[1,15824,14,15824],[1,15815,14,15815],[1,15816,14,15816],[1,15817,14,15817],[1,15818,14,15818],[1,15819,14,15819],[1,15810,14,15810],[1,15811,14,15811],[1,15812,14,15812],[1,15813,14,15813],[1,15814,14,15814],[1,15805,14,15805],[1,15806,14,15806],[1,15807,14,15807],[1,15808,14,15808],[1,15809,14,15809],[1,15800,14,15800],[1,15801,14,15801],[1,15802,14,15802],[1,15803,14,15803],[1,15804,14,15804],[1,15795,14,15795],[1,15796,14,15796],[1,15797,14,15797],[1,15798,14,15798],[1,15799,14,15799],[1,15790,14,15790],[1,15791,14,15791],[1,15792,14,15792],[1,15793,14,15793],[1,15794,14,15794],[1,15785,14,15785],[1,15786,14,15786],[1,15787,14,15787],[1,15788,14,15788],[1,15789,14,15789],[1,15780,14,15780],[1,15781,14,15781],[1,15782,14,15782],[1,15783,14,15783],[1,15784,14,15784],[1,15775,14,15775],[1,15776,14,15776],[1,15777,14,15777],[1,15778,14,15778],[1,15779,14,15779],[1,15770,14,15770],[1,15771,14,15771],[1,15772,14,15772],[1,15773,14,15773],[1,15774,14,15774],[1,15765,14,15765],[1,15766,14,15766],[1,15767,14,15767],[1,15768,14,15768],[1,15769,14,15769],[1,15760,14,15760],[1,15761,14,15761],[1,15762,14,15762],[1,15763,14,15763],[1,15764,14,15764],[1,15755,14,15755],[1,15756,14,15756],[1,15757,14,15757],[1,15758,14,15758],[1,15759,14,15759],[1,15750,14,15750],[1,15751,14,15751],[1,15752,14,15752],[1,15753,14,15753],[1,15754,14,15754],[1,15745,14,15745],[1,15746,14,15746],[1,15747,14,15747],[1,15748,14,15748],[1,15749,14,15749],[1,15740,14,15740],[1,15741,14,15741],[1,15742,14,15742],[1,15743,14,15743],[1,15744,14,15744],[1,15735,14,15735],[1,15736,14,15736],[1,15737,14,15737],[1,15738,14,15738],[1,15739,14,15739],[1,15730,14,15730],[1,15731,14,15731],[1,15732,14,15732],[1,15733,14,15733],[1,15734,14,15734],[1,15725,14,15725],[1,15726,14,15726],[1,15727,14,15727],[1,15728,14,15728],[1,15729,14,15729],[1,15720,14,15720],[1,15721,14,15721],[1,15722,14,15722],[1,15723,14,15723],[1,15724,14,15724],[1,15715,14,15715],[1,15716,14,15716],[1,15717,14,15717],[1,15718,14,15718],[1,15719,14,15719],[1,15710,14,15710],[1,15711,14,15711],[1,15712,14,15712],[1,15713,14,15713],[1,15714,14,15714],[1,15705,14,15705],[1,15706,14,15706],[1,15707,14,15707],[1,15708,14,15708],[1,15709,14,15709],[1,15700,14,15700],[1,15701,14,15701],[1,15702,14,15702],[1,15703,14,15703],[1,15704,14,15704],[1,15695,14,15695],[1,15696,14,15696],[1,15697,14,15697],[1,15698,14,15698],[1,15699,14,15699],[1,15690,14,15690],[1,15691,14,15691],[1,15692,14,15692],[1,15693,14,15693],[1,15694,14,15694],[1,15685,14,15685],[1,15686,14,15686],[1,15687,14,15687],[1,15688,14,15688],[1,15689,14,15689],[1,15680,14,15680],[1,15681,14,15681],[1,15682,14,15682],[1,15683,14,15683],[1,15684,14,15684],[1,15675,14,15675],[1,15676,14,15676],[1,15677,14,15677],[1,15678,14,15678],[1,15679,14,15679],[1,15670,14,15670],[1,15671,14,15671],[1,15672,14,15672],[1,15673,14,15673],[1,15674,14,15674],[1,15665,14,15665],[1,15666,14,15666],[1,15667,14,15667],[1,15668,14,15668],[1,15669,14,15669],[1,15660,14,15660],[1,15661,14,15661],[1,15662,14,15662],[1,15663,14,15663],[1,15664,14,15664],[1,15655,14,15655],[1,15656,14,15656],[1,15657,14,15657],[1,15658,14,15658],[1,15659,14,15659],[1,15650,14,15650],[1,15651,14,15651],[1,15652,14,15652],[1,15653,14,15653],[1,15654,14,15654],[1,15645,14,15645],[1,15646,14,15646],[1,15647,14,15647],[1,15648,14,15648],[1,15649,14,15649],[1,15640,14,15640],[1,15641,14,15641],[1,15642,14,15642],[1,15643,14,15643],[1,15644,14,15644],[1,15635,14,15635],[1,15636,14,15636],[1,15637,14,15637],[1,15638,14,15638],[1,15639,14,15639],[1,15630,14,15630],[1,15631,14,15631],[1,15632,14,15632],[1,15633,14,15633],[1,15634,14,15634],[1,15625,14,15625],[1,15626,14,15626],[1,15627,14,15627],[1,15628,14,15628],[1,15629,14,15629],[1,15620,14,15620],[1,15621,14,15621],[1,15622,14,15622],[1,15623,14,15623],[1,15624,14,15624],[1,15615,14,15615],[1,15616,14,15616],[1,15617,14,15617],[1,15618,14,15618],[1,15619,14,15619],[1,15610,14,15610],[1,15611,14,15611],[1,15612,14,15612],[1,15613,14,15613],[1,15614,14,15614],[1,15605,14,15605],[1,15606,14,15606],[1,15607,14,15607],[1,15608,14,15608],[1,15609,14,15609],[1,15600,14,15600],[1,15601,14,15601],[1,15602,14,15602],[1,15603,14,15603],[1,15604,14,15604],[1,15595,14,15595],[1,15596,14,15596],[1,15597,14,15597],[1,15598,14,15598],[1,15599,14,15599],[1,15590,14,15590],[1,15591,14,15591],[1,15592,14,15592],[1,15593,14,15593],[1,15594,14,15594],[1,15585,14,15585],[1,15586,14,15586],[1,15587,14,15587],[1,15588,14,15588],[1,15589,14,15589],[1,15580,14,15580],[1,15581,14,15581],[1,15582,14,15582],[1,15583,14,15583],[1,15584,14,15584],[1,15575,14,15575],[1,15576,14,15576],[1,15577,14,15577],[1,15578,14,15578],[1,15579,14,15579],[1,15570,14,15570],[1,15571,14,15571],[1,15572,14,15572],[1,15573,14,15573],[1,15574,14,15574],[1,15565,14,15565],[1,15566,14,15566],[1,15567,14,15567],[1,15568,14,15568],[1,15569,14,15569],[1,15560,14,15560],[1,15561,14,15561],[1,15562,14,15562],[1,15563,14,15563],[1,15564,14,15564],[1,15555,14,15555],[1,15556,14,15556],[1,15557,14,15557],[1,15558,14,15558],[1,15559,14,15559],[1,15550,14,15550],[1,15551,14,15551],[1,15552,14,15552],[1,15553,14,15553],[1,15554,14,15554],[1,15545,14,15545],[1,15546,14,15546],[1,15547,14,15547],[1,15548,14,15548],[1,15549,14,15549],[1,15540,14,15540],[1,15541,14,15541],[1,15542,14,15542],[1,15543,14,15543],[1,15544,14,15544],[1,15535,14,15535],[1,15536,14,15536],[1,15537,14,15537],[1,15538,14,15538],[1,15539,14,15539],[1,15530,14,15530],[1,15531,14,15531],[1,15532,14,15532],[1,15533,14,15533],[1,15534,14,15534],[1,15525,14,15525],[1,15526,14,15526],[1,15527,14,15527],[1,15528,14,15528],[1,15529,14,15529],[1,15520,14,15520],[1,15521,14,15521],[1,15522,14,15522],[1,15523,14,15523],[1,15524,14,15524],[1,15515,14,15515],[1,15516,14,15516],[1,15517,14,15517],[1,15518,14,15518],[1,15519,14,15519],[1,15510,14,15510],[1,15511,14,15511],[1,15512,14,15512],[1,15513,14,15513],[1,15514,14,15514],[1,15505,14,15505],[1,15506,14,15506],[1,15507,14,15507],[1,15508,14,15508],[1,15509,14,15509],[1,15500,14,15500],[1,15501,14,15501],[1,15502,14,15502],[1,15503,14,15503],[1,15504,14,15504],[1,15495,14,15495],[1,15496,14,15496],[1,15497,14,15497],[1,15498,14,15498],[1,15499,14,15499],[1,15490,14,15490],[1,15491,14,15491],[1,15492,14,15492],[1,15493,14,15493],[1,15494,14,15494],[1,15485,14,15485],[1,15486,14,15486],[1,15487,14,15487],[1,15488,14,15488],[1,15489,14,15489],[1,15480,14,15480],[1,15481,14,15481],[1,15482,14,15482],[1,15483,14,15483],[1,15484,14,15484],[1,15475,14,15475],[1,15476,14,15476],[1,15477,14,15477],[1,15478,14,15478],[1,15479,14,15479],[1,15470,14,15470],[1,15471,14,15471],[1,15472,14,15472],[1,15473,14,15473],[1,15474,14,15474],[1,15465,14,15465],[1,15466,14,15466],[1,15467,14,15467],[1,15468,14,15468],[1,15469,14,15469],[1,15460,14,15460],[1,15461,14,15461],[1,15462,14,15462],[1,15463,14,15463],[1,15464,14,15464],[1,15455,14,15455],[1,15456,14,15456],[1,15457,14,15457],[1,15458,14,15458],[1,15459,14,15459],[1,15450,14,15450],[1,15451,14,15451],[1,15452,14,15452],[1,15453,14,15453],[1,15454,14,15454],[1,15445,14,15445],[1,15446,14,15446],[1,15447,14,15447],[1,15448,14,15448],[1,15449,14,15449],[1,15440,14,15440],[1,15441,14,15441],[1,15442,14,15442],[1,15443,14,15443],[1,15444,14,15444],[1,15435,14,15435],[1,15436,14,15436],[1,15437,14,15437],[1,15438,14,15438],[1,15439,14,15439],[1,15430,14,15430],[1,15431,14,15431],[1,15432,14,15432],[1,15433,14,15433],[1,15434,14,15434],[1,15425,14,15425],[1,15426,14,15426],[1,15427,14,15427],[1,15428,14,15428],[1,15429,14,15429],[1,15420,14,15420],[1,15421,14,15421],[1,15422,14,15422],[1,15423,14,15423],[1,15424,14,15424],[1,15415,14,15415],[1,15416,14,15416],[1,15417,14,15417],[1,15418,14,15418],[1,15419,14,15419],[1,15410,14,15410],[1,15411,14,15411],[1,15412,14,15412],[1,15413,14,15413],[1,15414,14,15414],[1,15405,14,15405],[1,15406,14,15406],[1,15407,14,15407],[1,15408,14,15408],[1,15409,14,15409],[1,15400,14,15400],[1,15401,14,15401],[1,15402,14,15402],[1,15403,14,15403],[1,15404,14,15404],[1,15395,14,15395],[1,15396,14,15396],[1,15397,14,15397],[1,15398,14,15398],[1,15399,14,15399],[1,15390,14,15390],[1,15391,14,15391],[1,15392,14,15392],[1,15393,14,15393],[1,15394,14,15394],[1,15385,14,15385],[1,15386,14,15386]],"merged_total":16391,"flags":["merged_cut"]}
[]
[{"$f":"IF(Lizenz!C14=\"NOK\",\"unlizensierte Testversion\",\"\")","v":"unlizensierte Testversion"},null,null,null,null,null,null,null,null,null,null,null,null,{"$f":"A2","v":"unlizensierte Testversion"}]
[]
[]
[null,null,null,null,null,null,null,null,null,null,{"$f":"IF(Lizenz!C14=\"OK\",\"Lizenz \" & Lizenz!C13,\"\")","v":""}]
[null,null,"ALLGEMEINE DATEN"]
[]
[null,null,"Name Fotodokument:",null,"Muster Fotodokument"]
[null,null,"Erstellt am:",null,{"$f":"TODAY()","v":"2016-02-11"}]
[null,null,"Erstellt von:",null,"Max Muster"]
[null,null,"EINSTELLUNGEN"]
[]
[null,null,null,null,"C:\\"]
[]
[]
[null,null,"Auswahl Seiten-Vorlage:"]
[]
[]
[]
[]
[]
[]
[]
[{"$f":"A2","v":"unlizensierte Testversion"},null,null,null,"5  Fotos \nmit feinen Linien","5  Fotos\nohne feine Linien","3 Fotos\nmit Linien","5 Fotos\nohne Linien",null,null,null,null,null,{"$f":"A2","v":"unlizensierte Testversion"}]
[null,null,null,"Titelblatt erstellen:","Ja"]
[null,null,null,"Fotonamen anzeigen:","Ja"]
[null,null,"KOPF- UND FUßZEILE"]
[]
[null,null,null,"Text Kopfzeile:","Einige Impressionen"]
[null,null,null,"Text Fußzeile:","Die Fotos wurden gemacht von Max Muster"]
[null,null,null,"Seitenzahlen anzeigen:","Ja"]
[]
[]
[null,"Version 1.2"]
[null,null,null,null,null,null,null,null,null,{"$f":"IF(Lizenz!C14=\"NOK\",\"unlizensierte Testversion, Vollversion erhältlich unter:\",\"\")","v":"unlizensierte Testversion, Vollversion erhältlich unter:"}]

{"sheet":"Vorteile VOLLVERSION","index":1,"n_rows":41,"n_cols":18,"rows_kept":41,"cut":false,"hidden":false,"merged":[[38,4,38,17],[39,4,39,17],[40,4,40,17],[35,5,35,17],[36,5,36,17],[29,2,29,17],[30,2,30,17],[31,2,31,17],[32,13,32,17],[32,11,32,12],[32,2,32,3],[32,4,32,8],[2,1,3,18],[5,1,5,18],[6,1,6,18],[7,1,7,18],[19,2,19,17],[9,3,9,16],[10,3,10,16],[11,3,11,16],[12,3,12,16],[13,3,13,16],[15,2,15,17],[16,2,16,17],[17,2,17,17],[18,2,18,17],[4,1,4,18]]}
[]
[]
[null,"FotoDoku"]
[]
[null," Individuelle Fotodokumente einfach und schnell erstellt"]
[null,"Version 1.2 vom 08.02.2016"]
[null,{"$f":"IF(Lizenz!C14=\"OK\",\"Gratulation. Sie haben die Vollversion von FotoDoku.\",\"Sie haben die unlizensierte Testversion von FotoDoku.\")","v":"Sie haben die unlizensierte Testversion von FotoDoku."}]
[null,{"$f":"IF(Lizenz!C14=\"OK\",\"\",\"Der Kauf der Vollversion bringt ihnen die folgende Vorteile:\")","v":"Der Kauf der Vollversion bringt ihnen die folgende Vorteile:"}]
[]
[null,null,"●","Keine Hinweistexte und Hinweisbildschirme auf die unlizensierte Version",null,null,null,null,null,null,null,null,null,null,null,null,null,"P"]
[null,null,"●","Verarbeitung über 2000 Fotos (entspricht je nach Vorlage zwischen 400 und 666 Seiten)",null,null,null,null,null,null,null,null,null,null,null,null,null,"P"]
[null,null,"●","Sie erhalten alle zukünftigen Updates kostenlos (außer große Versionssprünge)",null,null,null,null,null,null,null,null,null,null,null,null,null,"P"]
[null,null,"●","Sie erhalten immer die neueste Version per E-Mail zugeschickt",null,null,null,null,null,null,null,null,null,null,null,null,null,"P"]
[null,null,"●","Sie unterstützen die Pflege und Weiterentwicklung des Programms",null,null,null,null,null,null,null,null,null,null,null,null,null,"P"]
[]
[null,null,"Vorlagenerstellung nach ihren Wünschen:"]
[null,null,"Gerne erstelle ich ihnen Vorlagen nach ihren Wünschen. Das kann das Titelblatt und/oder auch eine "]
[null,null,"Seitenvorlage sein. "]
[null,null,"Senden Sie mir dazu einfach ihren Vorlagen-Entwurf und ich implementiere diesen in ihre lizensierte"]
[null,null,"Version von FotoDoku. Der Preis hierfür beträgt pauschal 25.- Euro. Bei umfangreicheren Wünschen,"]
[null,null,"erstelle ich ihnen vorab gerne ein Angebot."]
[]
[]
[]
[]
[]
[]
[]
[]
[null,null,"Feedback und Rückmeldungen"]
[null,null,"Über Verbesserungen und Anregungen, die zur Weiterentwicklung des Programms beitragen,"]
[null,null,"freue ich mich jederzeit. Nehmen Sie mit mir Kontakt auf:"]
[null,null,"E-Mail:",null,null,null,null,null,null,null,null,"Web: "]
[]
[]
[null,null,"Systemanforderungen:",null,null,"PC mit Microsoft Excel ab Version 2010 (getestet mit Excel 2010, 2013 und 2016)"]
[null,null,null,null,null,"PC mit mindestens 2 MB RAM"]
[]
[null,null,"Haftung:",null,"Ich übernehme keinerlei Haftung für Programmfehler oder (Fehl-) Entscheidungen die durch die"]
[null,null,null,null,"Nutzung des Programms getroffen werden. Für die Richtigkeit aller Inhalte kann trotz grösster Sorgfalt"]
[null,null,null,null,"bei der Erstellung keine Garantie gewährt werden."]

{"sheet":"Vorlage-1","index":2,"n_rows":0,"n_cols":0,"rows_kept":0,"cut":false,"hidden":false,"merged":[[30,7,30,10],[0,0,0,10],[10,7,10,10],[46,7,46,10],[47,7,47,10],[1,0,12,0],[1,7,1,10],[2,7,2,10],[3,7,3,10],[4,7,4,10],[5,7,5,10],[6,7,6,10],[7,7,7,10],[8,7,8,10],[9,7,9,10],[1,1,12,6],[48,7,48,10],[11,7,11,10],[25,7,25,10],[26,7,26,10],[27,7,27,10],[32,7,32,10],[33,7,33,10],[21,7,21,10],[22,7,22,10],[23,7,23,10],[28,7,28,10],[29,7,29,10],[12,7,12,10],[31,7,31,10],[44,7,44,10],[39,7,39,10],[13,1,24,6],[25,1,36,6],[37,1,48,6],[25,0,36,0],[51,7,51,10],[45,7,45,10],[24,7,24,10],[13,0,24,0],[13,7,13,10],[14,7,14,10],[15,7,15,10],[16,7,16,10],[17,7,17,10],[18,7,18,10],[19,7,19,10],[20,7,20,10],[40,7,40,10],[41,7,41,10],[42,7,42,10],[43,7,43,10],[34,7,34,10],[35,7,35,10],[36,7,36,10],[37,7,37,10],[38,7,38,10],[49,0,60,0],[37,0,48,0],[58,7,58,10],[61,0,61,8],[61,9,61,10],[49,1,60,6],[52,7,52,10],[53,7,53,10],[54,7,54,10],[55,7,55,10],[56,7,56,10],[57,7,57,10],[59,7,59,10],[60,7,60,10],[49,7,49,10],[50,7,50,10]]}

{"sheet":"Vorlage-2","index":3,"n_rows":0,"n_cols":0,"rows_kept":0,"cut":false,"hidden":false,"merged":[[25,0,36,0],[25,1,36,6],[13,7,24,10],[25,7,36,10],[37,7,48,10],[61,0,61,8],[49,0,60,0],[49,1,60,6],[37,0,48,0],[37,1,48,6],[49,7,60,10],[61,9,61,10],[1,7,12,10],[1,0,12,0],[1,1,12,6],[0,0,0,10],[13,0,24,0],[13,1,24,6]]}

{"sheet":"Vorlage-3","index":4,"n_rows":0,"n_cols":0,"rows_kept":0,"cut":false,"hidden":false,"merged":[[0,0,0,10],[1,0,20,0],[21,0,40,0],[41,0,60,0],[1,1,17,8],[1,9,17,10],[21,9,37,10],[21,1,37,8],[18,1,18,10],[41,1,57,8],[41,9,57,10],[20,1,20,10],[19,1,19,10],[61,9,61,10],[58,1,58,10],[38,1,38,10],[39,1,39,10],[40,1,40,10],[59,1,59,10],[60,1,60,10],[61,0,61,8]]}

{"sheet":"Vorlage-4","index":5,"n_rows":0,"n_cols":0,"rows_kept":0,"cut":false,"hidden":false,"merged":[[0,0,0,10],[1,0,12,0],[1,1,12,6],[1,7,12,10],[13,0,24,0],[13,1,24,6],[13,7,24,10],[25,0,36,0],[25,1,36,6],[25,7,36,10],[37,0,48,0],[37,1,48,6],[37,7,48,10],[49,0,60,0],[49,1,60,6],[49,7,60,10],[61,0,61,8],[61,9,61,10]]}

{"sheet":"Titelblatt","index":6,"n_rows":46,"n_cols":1,"rows_kept":46,"cut":false,"hidden":false,"merged":[[60,0,60,10],[61,0,61,10],[59,1,59,3],[58,1,58,3],[54,0,54,10],[55,0,55,10],[57,1,57,3],[56,1,56,3],[56,4,56,10],[49,0,49,10],[50,0,50,10],[51,0,51,10],[52,0,52,10],[53,0,53,10],[38,0,38,10],[47,0,47,10],[48,0,48,10],[2,0,12,10],[0,0,1,10],[75,0,99,10],[100,0,123,10],[73,0,73,10],[62,0,72,10],[13,0,37,10],[46,0,46,10],[45,0,45,10],[44,0,44,10],[43,0,43,10],[42,0,42,10],[41,0,41,10],[40,0,40,10],[39,0,39,10],[59,4,59,10],[58,4,58,10],[57,4,57,10]]}
[]
[]
["Hier kann die Bezeichnung\ndes Fotodokuments\neingegeben werden\n\noder auch ein Firmenlogo"]
[]
[]
[]
[]
[]
[]
[]
[]
[]
[]
["Hier kann ein Foto eingefügt werden"]
[]
[]
[]
[]
[]
[]
[]
[]
[]
[]
[]
[]
[]
[]
[]
[]
[]
[]
[]
[]
[]
[]
[]
[]
[]
[]
[]
[]
["Hier"]
["kann weiterer"]
["Text eingegeben"]
["werden"]

{"sheet":"Anleitung","index":7,"n_rows":87,"n_cols":12,"rows_kept":87,"cut":false,"hidden":false,"merged":[[66,1,66,18],[59,1,59,18],[70,1,70,18],[20,1,20,18],[38,1,38,18],[40,1,40,18],[42,1,42,18],[43,1,43,18],[44,1,44,18],[45,1,45,18],[67,1,67,18],[68,1,68,18],[56,1,56,18],[55,1,55,18],[46,1,46,18],[60,1,60,18],[7,1,7,18],[9,1,9,18],[8,1,8,18],[10,1,10,18],[28,1,28,18],[17,1,17,18],[18,1,18,18],[19,1,19,18],[25,1,25,18],[26,1,26,18],[27,1,27,18],[21,1,21,18],[22,1,22,18],[23,1,23,18],[24,1,24,18],[86,2,86,3],[86,4,86,8],[86,11,86,12],[86,13,86,17],[83,2,83,17],[84,2,84,17],[85,2,85,17],[75,1,75,18],[32,1,32,18],[41,1,41,18],[71,1,71,18],[72,1,72,18],[73,1,73,18],[74,1,74,18],[69,1,69,18],[37,1,37,18],[36,1,36,18],[65,1,65,18],[62,1,62,18],[63,1,63,18],[64,1,64,18],[47,1,47,18],[48,1,48,18],[1,1,2,18],[3,1,3,18],[4,1,4,18],[5,1,5,18],[6,1,6,18],[31,1,31,18],[57,1,57,18],[61,1,61,18],[39,1,39,18],[50,1,50,18],[51,1,51,18],[52,1,52,18],[53,1,53,18],[54,1,54,18],[49,1,49,18]]}
[]
[null,"Anleitung"]
[]
[null,"FotoDoku   -   Version 1.2 vom 08.02.2016"]
[null,"                                    Aktuelle Anleitung im PDF-Format kostenlos downloaden: "]
[]
[null,"1   Einführung"]
[null,"Sie haben viele Fotos mit der Kamera oder auch dem Handy gemacht und möchten diese so ablegen, dass Sie auch Wochen, Monate und Jahre später noch wissen was Sie da eigentlich fotografiert haben. Genau hier unterstützt Sie FotoDoku. Mit FotoDoku erstellen Sie einfach und schnell ihre individuellen Fotodokumente mit mehr als 2000 Fotos. Wählen Sie die Bilder aus und versehen Sie jedes Bild mit Text, Symbolen oder Zeichen. Schliesslich speichern Sie das Fotodokument als PDF ab.  \nEinsatzbereiche gibt es viele. Beispiele dafür sind: Bautagebücher, Berichte jeglicher Art, Beschreibungen, Anleitungen, Fotobücher ihres letzten Urlaubs oder von Geburtstagsfeiern,  Exposés, Gutachten und viele mehr."]
[null,"2   Aufbau und Bedienung von FotoDoku"]
[null,"FotoDoku besteht aus dem Arbeitsblatt «FotoDoku», den «Vorlagen 1 bis 4», dem «Titelblatt» und den unterstützenden Blättern «Vorteile VOLLVERSION», «Anleitung», «Lizenz» und «Stammdaten».\n\n\n                                                                    Bild1: Tabellenblätter von FotoDoku\n\nDas Blatt «FotoDoku» stellt das Hauptmaske der Anwendung dar. Hier wird alles definiert, was zur Erstellung eines Fotodokuments benötigt wird. Im Folgenden wird die Erstellung eines Fotodokuments beschrieben:\n"]
[]
[]
[]
[]
[]
[]
[]
[null,"            Bild 2: Hauptmaske von Fotodoku"]
[]
[null,"2.1  Allgemeine Daten"]
[null,"Im Bereich ALLGEMEINE DATEN gibt es zwei Eingabemöglichkeiten. Diese Angaben erscheinen später auch auf dem Titelblatt. Zum Titelblatt lesen Sie bitte auch Kapitel \"3 Fotodokument bearbeiten\".\n"]
[null,"2.1.1   Name Fotodokument:"]
[null,"In diese Zeile können Sie den Namen des Fotodokuments eingeben. Dieser Name erscheint unten auf dem Titelblatt. Es wird empfohlen, die generierte Excel-Datei (das Fotodokument) auch mit diesem Namen abzuspeichern (siehe auch Kapitel \"4 Abspeichern\"). Diese Zeile kann auch leer gelassen werden. "]
[null,"2.1.2   Erstellt von:"]
[null,"In diese Zeile können Sie den Namen der Erstellerin bzw. des Erstellers eingeben. Dieser Name erscheint unten auf dem Titelblatt. Diese Zeile kann auch leer gelassen werden. \n\nBei \"Erstellt am:\" wird automatisch das Tagesdatum eingefügt. \n"]
[null,"2.2  Einstellungen"]
[null,"Im Bereich EINSTELLUNGEN legen Sie das Layout des Fotodokumentes fest und wählen das Verzeichnis aus, in dem die Fotos abgelegt sind. "]
[null,"2.2.1   Foto-Verzeichnis wählen:"]
[null,"Nach Klick auf den Button \"Foto-Verzeichnis wählen\" öffnet sich folgendes Auswahlfenster:"]
[]
[]
[null,"\n\n\n\n\nBild 3: Auswahlfenster Verzeichnis der Fotoablage"]
[null,"Hier können Sie das Verzeichnis auswählen, in welchem die Fotos, die in das Fotodokument eingefügt werden sollen, abgelegt sind. \nAlternativ können Sie das Verzeichnis auch direkt aus dem Windows-Datei-Explorer heraus kopieren und in die Zeile \"Foto-Verzeichnis wählen\" einfügen:\n"]
[]
[]
[]
[null,"\nBild 4: Dateiauswahl direkt aus dem Windows-Datei-Explorer kopieren"]
[null,"\n\nTIPP: Vorbearbeitung der Fotos\nWählen Sie die Fotos, die Sie im Fotodokument haben möchten im Windows-Datei-Explorer aus und kopieren Sie sie in einen separaten Ordner. \nFotos die verdreht im Ordner abgelegt sind, drehen Sie am besten direkt im Windows-Datei-Explorer. Ansonsten sind sie später auch im Fotodokument verdreht (können dort aber auch noch manuell gedreht werden). Beispiel:\n\n\n\n\n\n\n\n\n\n\n                                                               Bild 5: Fotos im Windows-Datei-Explorer drehen"]
[null,"2.2.2   Auswahl Seiten-Vorlage:"]
[null,"Hier können Sie aus 4 Seiten-Vorlagen eine auswählen. Am besten einfach mal alle Vorlagen durchprobieren und sehen, welche für die eigenen Bedürfnisse am besten geeignet ist. Alle Vorlagen sind mit einem Blattschutz versehen, so dass sie nicht geändert werden können. Wenn Sie Anregungen für weitere Vorlagen oder spezielle Vorlagen Wünsche haben, können Sie diese gerne an mich senden: "]
[null,"2.2.3   Titelblatt erstellen:"]
[null,"Durch die Auswahl von \"Ja\" oder \"Nein\" legen Sie fest, ob das Fotodokument eine Titelseite erhält. "]
[null,"2.2.4   Fotonamen anzeigen:"]
[null,"Durch die Auswahl von \"Ja\" oder \"Nein\" legen Sie fest, ob im Fotodokument neben jedem Foto der Fotoname angezeigt wird. \n\n\nHinweis:  Die Vorlagen der Seiten und auch die Titelblatt-Vorlage können Sie nicht selbst ändern. Es ist aber möglich, später im fertigen Fotodokument das Titelblatt und auch die einzelnen Seiten mit den ganz normalen Excel-Funktionen zu bearbeiten. Dazu später im Kapitel \"3 Fotodokument bearbeiten\" mehr."]
[null,"2.3  Kopf- und Fußzeile"]
[null,"Im Bereich KOPF- UND FUßZEILE legen Sie die Texte, welche im Fotodokument in der Kopf- und Fußzeile erscheinen, fest. "]
[null,"2.3.1   Text Kopfzeile:"]
[null,"In diese Zeile können Sie den Text eingeben, der im Fotodokument auf jeder Seite (außer dem Titelblatt) in der Kopfzeile erscheint. Diese Zeile kann auch leer gelassen werden. \nDie Kopfzeile kann später auch im fertigen Fotodokument ergänzt werden (allerdings manuell Seite für Seite)."]
[null,"2.3.2   Text Fußzeile:"]
[null,"In diese Zeile können Sie den Text eingeben, der im Fotodokument auf jeder Seite (außer dem Titelblatt) in der Fußzeile erscheint. Diese Zeile kann auch leer gelassen werden. \nDie Fußzeile kann später auch im fertigen Fotodokument ergänzt werden (allerdings manuell Seite für Seite)."]
[null,"2.3.3   Seitenzahlen anzeigen:"]
[null,"Durch die Auswahl von \"Ja\" oder \"Nein\" legen Sie fest, ob im Fotodokument die Seitenzahlen angezeigt werden. "]
[null,"2.4  Fotodokument generieren"]
[null,"Haben Sie alle Eingaben vorgenommen? Dann klicken Sie auf den Button \"Fotodokument generieren\" und schon wird das Fotodokument in einem neuen Excel-Tabellenblatt erstellt.\n\nKeine Angst, Sie können nichts falsch machen. Am besten Sie probieren am Anfang alle Vorlagen mal aus und geben in die verschiedenen Textzeilen einfach mal was ein, klicken dann auf generieren und schauen, wie das Fotodokument heraus kommt.\n\n\n\n"]
[null,"3  Fotodokument bearbeiten"]
[null,"Das Fotodokument wird in einem neuen Excel-Tabellenblatt erstellt. Im folgenden wird kurz beschrieben, wie es mit Titelblatt, Kopf- und Fußteile, Seitenzahl und Fotonamen aussehen kann. Verwendet wurde die Vorlage 1.\nBeispiel Titelblatt:"]
[]
[]
[]
[null,"Hinweis: Sie können für alle Eingaben (Schriftarten, Schriftgrößen, Farben, Effekte) und Fotos die ganz normalen Excel-Formatierungsfunktionen verwenden und dadurch das Titelblatt individuell gestalten. "]
[null,"Beispiel Fotodokumentseite"]
[]
[]
[]
[]
[]
[null,"Ihre Fotodokumente lassen sich beliebig beschriften, bezeichnen und markieren. Ganz einfach mit den Excel-Standard-Tools: Menü Einfügen --> Formen\nHinweis: Mit der unlizensierte Testversion können maximal 4 Seiten erstellt werden (Vollversion über 600)!\nDie Vollversion können Sie hier beziehen: "]
[null,"4  Abspeichern"]
[null,"Zum abspeichern ihres Fotodokuments wird empfohlen, zuerst die Originaldatei (also die Excel-Datei) zu speichern. Unabhängig davon wird empfphlen, die Excel-Datei während der Bearbeitung hin und wieder zu speichern um Datenverlust zu verhindern.\n\nWenn Sie mit ihren individuellen Eingaben fertig sind, speichern Sie das Fotodokument einfach \nals PDF-Datei ab: Menü -> Datei -> Speichern unter --> Dateiname eingeben --> bei Dateityp \"PDF\" auswählen --> auf Button \"Speichern\" klicken\n\nFertig ist ihr Fotodokument."]
[null,"5 Versionshistorie:"]
[null,"Version 1.2 (08.02.2016)\nDie Version 1.1 wurde vollkommen überarbeitet. Optisch und inhhaltlich wurde das Programm verbessert. Es gibt nun 4 Vorlagen und eine Titelseite. Alles ist komfortabel auswählbar. \n\nVersion 1.1 (30.11.2015)\nDie erster Version von FotoDoku bestand. Keine schöne Darstellung, nur 1 Vorlage, ohne Titelblatt. Diese Version wurde nicht veröffentlicht. "]
[null,"6 Systemanforderungen:"]
[null,"●  Microsoft Excel 2010, 2013 und 2016  (Version 2007 bisher nicht getestet)\n●  PC Anforderungen: Mindestens 2 MB RAM. Je mehr RAM, desto schneller läuft die Verarbeitung großer \n     Foto-Mengen.\n"]
[null,"7 Haftungsausschluss:"]
[null,"Ich übernehme keinerlei Haftung für Programmfehler oder (Fehl-) Entscheidungen, die durch die Nutzung des Programmes getroffen werden.\n"]
[]
[]
[]
[]
[]
[]
[]
[]
[null,null,"Feedback und Rückmeldungen"]
[null,null,"Über Verbesserungen und Anregungen, die zur Weiterentwicklung des Programms beitragen,"]
[null,null,"freue ich mich jederzeit. Nehmen Sie mit mir Kontakt auf:"]
[null,null,"E-Mail:",null,null,null,null,null,null,null,null,"Web: "]

{"sheet":"Lizenz","index":8,"n_rows":18,"n_cols":26,"rows_kept":18,"cut":false,"hidden":false,"merged":[]}
[]
[null,"Lizensierungsdaten für Fotodokument"]
[null,null,"Geben Sie hier ihre Lizensierungsdaten ein"]
[null,"Firma:",null,null,null,null,null,null,null,null,null,null,null,null,null,null,null,null,null,null,null,null,null,null,{"$f":"LEN(C4)","v":0}]
[null,"Name:",0,null,null,null,null,null,null,null,null,null,null,null,null,null,null,null,null,null,null,null,null,null,{"$f":"LEN(C5)","v":1},{"$f":"LEFT(C5,1)","v":"0"}]
[null,"Vorname:",0,null,null,null,null,null,null,null,null,null,null,null,null,null,null,null,null,null,null,null,null,null,1,{"$f":"LEFT(C6,1)","v":"0"}]
[null,"Straße:",0,null,null,null,null,null,null,null,null,null,null,null,null,null,null,null,null,null,null,null,null,null,1,"0"]
[null,"Hausnummer:",0,null,null,null,null,null,null,null,null,null,null,null,null,null,null,null,null,null,null,null,null,null,1,{"$f":"RIGHT(C8,1)","v":"0"}]
[null,"PLZ:",0,null,null,null,null,null,null,null,null,null,null,null,null,null,null,null,null,null,null,null,null,null,1,"0"]
[null,"Ort:",0,null,null,null,null,null,null,null,null,null,null,null,null,null,null,null,null,null,null,null,null,null,1,{"$f":"LEFT(C10,2)","v":"0"}]
[null,"Land:",0,null,null,null,null,null,null,null,null,null,null,null,null,null,null,null,null,null,null,null,null,null,1,"0"]
[]
[null,"Freischaltcode:",0,null,null,null,null,null,null,null,null,null,null,null,null,null,null,null,null,null,null,null,null,"Summe",{"$f":"SUM(Y4:Y11)","v":7}]
[null,"Lizenz-Code:",{"$f":"IF(C13=Y18,\"OK\",\"NOK\")","v":"NOK"},null,null,null,null,null,null,null,null,null,null,null,null,null,null,null,null,null,null,null,null,"Summe-PLZ",{"$f":"Y13-Y9","v":6}]
[null,null,null,null,null,null,null,null,null,null,null,null,null,null,null,null,null,null,null,null,null,null,null,"Ort*Straße",{"$f":"Y10*Y7","v":1}]
[null,null,null,null,null,null,null,null,null,null,null,null,null,null,null,null,null,null,null,null,null,null,null,"PLZ*(Ort*Straße)",{"$f":"Y9*Y15","v":1}]
[]
[null,null,null,null,null,null,null,null,null,null,null,null,null,null,null,null,null,null,null,null,null,null,null,"Freischaltcode=",{"$f":"Y16*Y15-(Y13*Y14)&\"-\"&Z10&Y15&\"-\"&Z8","v":"-41-01-0"}]

{"sheet":"Stammdaten","index":9,"n_rows":6,"n_cols":4,"rows_kept":6,"cut":false,"hidden":false,"merged":[]}
[]
[null,"Stammdaten"]
[]
[null,"Titelblatt","Seitenzahl","Fotonamen"]
[null,"Ja","Ja","Ja"]
[null,"Nein","Nein","Nein"]